{"text_format":"1","workbook":"xlsx","n_sheets":7,"sheets":["random picks","Round order","BLANKS","ranks","PAYERS","webquery","results"],"not_rendered":{"charts":0,"images":1,"macros":1,"external_links":1,"defined_names":1,"comments":0,"pivot_tables":0},"unopened":[],"bounds":{"document_bytes":16777216,"sheet_cells":100000,"rows_first":2000,"rows_last":500,"rows_between":2000,"halvings":0,"cell_chars":16384,"cell_head_chars":4096},"cells_cut":0,"cells_raw":0,"read":"whole","date_system":"1900"}

{"sheet":"random picks","index":0,"n_rows":123,"n_cols":16,"rows_kept":123,"cut":false,"hidden":false,"merged":[]}
[]
[null,"BYRON","JOHN C","MIKE H","STEVER","ROB W","CRAIG T","ANDY W","STU D"]
["Random number generator for pick order"]
[null,{"$f":"B2","v":"BYRON"},{"$f":"C2","v":"JOHN C"},"MIKE H","STEVER","ROB W","CRAIG T"]
["R1",{"$f":"RAND()","v":5.7027286426887924E-2},{"$f":"RAND()","v":0.49557442143080788},8.9197954528915546E-2,0.11364680814245487,0.51152065806160452,0.7834757027307665]
["R2",0.94565760195798232,0.19090242551011505,0.95725475048065822,0.32558669924599004,0.23067182839559652,0.72716298442425364]
["R3",0.93011750378535574,0.26947478098132016,0.60693776664342447,4.2320980677485576E-2,0.84979374091595494,0.73588405309039584]
["R4",0.71599100253640502,0.762545996017298,0.86884014141221555,0.3622970143500327,0.34551452924102877,0.18847321706892139]
["R5",0.85733884196695487,0.65081961078984618,0.25967648433889778,0.66896883956956255,0.81955937659981082,9.356991616444299E-2]
["R1",{"$f":"RANK(B5,$B5:$L5)","v":6},3,5,4,2,1]
{"$rows_left_out":114}
{"sheet":"Round order","index":1,"n_rows":6,"n_cols":9,"rows_kept":6,"cut":false,"hidden":false,"merged":[]}
[null,1,2,3,4,5,6,7,8]
["R1",{"$f":"IF('random picks'!$B116=1,'random picks'!$B$2,IF('random picks'!$C116=1,'random picks'!$C$2,IF('random picks'!$D116=1,'random picks'!$D$2,IF('random picks'!$E116=1,'random picks'!$E$2,IF('random picks'!$F116=1,'random picks'!$F$2,IF('random picks'!$G116=1,'random picks'!$G$2,IF('random picks'!$H116=1,'random picks'!$H$2,IF('random picks'!$I116=1,'random picks'!$I$2))))))))","v":"CRAIG T"},{"$f":"IF('random picks'!$B116=2,'random picks'!$B$2,IF('random picks'!$C116=2,'random picks'!$C$2,IF('random picks'!$D116=2,'random picks'!$D$2,IF('random picks'!$E116=2,'random picks'!$E$2,IF('random picks'!$F116=2,'random picks'!$F$2,IF('random picks'!$G116=2,'random picks'!$G$2,IF('random picks'!$H116=2,'random picks'!$H$2,IF('random picks'!$I116=2,'random picks'!$I$2))))))))","v":"ANDY W"},{"$f":"IF('random picks'!$B116=3,'random picks'!$B$2,IF('random picks'!$C116=3,'random picks'!$C$2,IF('random picks'!$D116=3,'random picks'!$D$2,IF('random picks'!$E116=3,'random picks'!$E$2,IF('random picks'!$F116=3,'random picks'!$F$2,IF('random picks'!$G116=3,'random picks'!$G$2,IF('random picks'!$H116=3,'random picks'!$H$2,IF('random picks'!$I116=3,'random picks'!$I$2))))))))","v":"BYRON"},{"$f":"IF('random picks'!$B116=4,'random picks'!$B$2,IF('random picks'!$C116=4,'random picks'!$C$2,IF('random picks'!$D116=4,'random picks'!$D$2,IF('random picks'!$E116=4,'random picks'!$E$2,IF('random picks'!$F116=4,'random picks'!$F$2,IF('random picks'!$G116=4,'random picks'!$G$2,IF('random picks'!$H116=4,'random picks'!$H$2,IF('random picks'!$I116=4,'random picks'!$I$2))))))))","v":"MIKE H"},{"$f":"IF('random picks'!$B116=5,'random picks'!$B$2,IF('random picks'!$C116=5,'random picks'!$C$2,IF('random picks'!$D116=5,'random picks'!$D$2,IF('random picks'!$E116=5,'random picks'!$E$2,IF('random picks'!$F116=5,'random picks'!$F$2,IF('random picks'!$G116=5,'random picks'!$G$2,IF('random picks'!$H116=5,'random picks'!$H$2,IF('random picks'!$I116=5,'random picks'!$I$2))))))))","v":"JOHN C"},{"$f":"IF('random picks'!$B116=6,'random picks'!$B$2,IF('random picks'!$C116=6,'random picks'!$C$2,IF('random picks'!$D116=6,'random picks'!$D$2,IF('random picks'!$E116=6,'random picks'!$E$2,IF('random picks'!$F116=6,'random picks'!$F$2,IF('random picks'!$G116=6,'random picks'!$G$2,IF('random picks'!$H116=6,'random picks'!$H$2,IF('random picks'!$I116=6,'random picks'!$I$2))))))))","v":"STU D"},{"$f":"IF('random picks'!$B116=7,'random picks'!$B$2,IF('random picks'!$C116=7,'random picks'!$C$2,IF('random picks'!$D116=7,'random picks'!$D$2,IF('random picks'!$E116=7,'random picks'!$E$2,IF('random picks'!$F116=7,'random picks'!$F$2,IF('random picks'!$G116=7,'random picks'!$G$2,IF('random picks'!$H116=7,'random picks'!$H$2,IF('random picks'!$I116=7,'random picks'!$I$2))))))))","v":"ROB W"},{"$f":"IF('random picks'!$B116=8,'random picks'!$B$2,IF('random picks'!$C116=8,'random picks'!$C$2,IF('random picks'!$D116=8,'random picks'!$D$2,IF('random picks'!$E116=8,'random picks'!$E$2,IF('random picks'!$F116=8,'random picks'!$F$2,IF('random picks'!$G116=8,'random picks'!$G$2,IF('random picks'!$H116=8,'random picks'!$H$2,IF('random picks'!$I116=8,'random picks'!$I$2))))))))","v":"STEVER"}]
["R2",{"$f":"IF('random picks'!$B117=1,'random picks'!$B$2,IF('random picks'!$C117=1,'random picks'!$C$2,IF('random picks'!$D117=1,'random picks'!$D$2,IF('random picks'!$E117=1,'random picks'!$E$2,IF('random picks'!$F117=1,'random picks'!$F$2,IF('random picks'!$G117=1,'random picks'!$G$2,IF('random picks'!$H117=1,'random picks'!$H$2,IF('random picks'!$I117=1,'random picks'!$I$2))))))))","v":"STEVER"},{"$f":"IF('random picks'!$B117=2,'random picks'!$B$2,IF('random picks'!$C117=2,'random picks'!$C$2,IF('random picks'!$D117=2,'random picks'!$D$2,IF('random picks'!$E117=2,'random picks'!$E$2,IF('random picks'!$F117=2,'random picks'!$F$2,IF('random picks'!$G117=2,'random picks'!$G$2,IF('random picks'!$H117=2,'random picks'!$H$2,IF('random picks'!$I117=2,'random picks'!$I$2))))))))","v":"ROB W"},{"$f":"IF('random picks'!$B117=3,'random picks'!$B$2,IF('random picks'!$C117=3,'random picks'!$C$2,IF('random picks'!$D117=3,'random picks'!$D$2,IF('random picks'!$E117=3,'random picks'!$E$2,IF('random picks'!$F117=3,'random picks'!$F$2,IF('random picks'!$G117=3,'random picks'!$G$2,IF('random picks'!$H117=3,'random picks'!$H$2,IF('random picks'!$I117=3,'random picks'!$I$2))))))))","v":"BYRON"},{"$f":"IF('random picks'!$B117=4,'random picks'!$B$2,IF('random picks'!$C117=4,'random picks'!$C$2,IF('random picks'!$D117=4,'random picks'!$D$2,IF('random picks'!$E117=4,'random picks'!$E$2,IF('random picks'!$F117=4,'random picks'!$F$2,IF('random picks'!$G117=4,'random picks'!$G$2,IF('random picks'!$H117=4,'random picks'!$H$2,IF('random picks'!$I117=4,'random picks'!$I$2))))))))","v":"MIKE H"},{"$f":"IF('random picks'!$B117=5,'random picks'!$B$2,IF('random picks'!$C117=5,'random picks'!$C$2,IF('random picks'!$D117=5,'random picks'!$D$2,IF('random picks'!$E117=5,'random picks'!$E$2,IF('random picks'!$F117=5,'random picks'!$F$2,IF('random picks'!$G117=5,'random picks'!$G$2,IF('random picks'!$H117=5,'random picks'!$H$2,IF('random picks'!$I117=5,'random picks'!$I$2))))))))","v":"STU D"},{"$f":"IF('random picks'!$B117=6,'random picks'!$B$2,IF('random picks'!$C117=6,'random picks'!$C$2,IF('random picks'!$D117=6,'random picks'!$D$2,IF('random picks'!$E117=6,'random picks'!$E$2,IF('random picks'!$F117=6,'random picks'!$F$2,IF('random picks'!$G117=6,'random picks'!$G$2,IF('random picks'!$H117=6,'random picks'!$H$2,IF('random picks'!$I117=6,'random picks'!$I$2))))))))","v":"JOHN C"},{"$f":"IF('random picks'!$B117=7,'random picks'!$B$2,IF('random picks'!$C117=7,'random picks'!$C$2,IF('random picks'!$D117=7,'random picks'!$D$2,IF('random picks'!$E117=7,'random picks'!$E$2,IF('random picks'!$F117=7,'random picks'!$F$2,IF('random picks'!$G117=7,'random picks'!$G$2,IF('random picks'!$H117=7,'random picks'!$H$2,IF('random picks'!$I117=7,'random picks'!$I$2))))))))","v":"ANDY W"},{"$f":"IF('random picks'!$B117=8,'random picks'!$B$2,IF('random picks'!$C117=8,'random picks'!$C$2,IF('random picks'!$D117=8,'random picks'!$D$2,IF('random picks'!$E117=8,'random picks'!$E$2,IF('random picks'!$F117=8,'random picks'!$F$2,IF('random picks'!$G117=8,'random picks'!$G$2,IF('random picks'!$H117=8,'random picks'!$H$2,IF('random picks'!$I117=8,'random picks'!$I$2))))))))","v":"CRAIG T"}]
["R3",{"$f":"IF('random picks'!$B118=1,'random picks'!$B$2,IF('random picks'!$C118=1,'random picks'!$C$2,IF('random picks'!$D118=1,'random picks'!$D$2,IF('random picks'!$E118=1,'random picks'!$E$2,IF('random picks'!$F118=1,'random picks'!$F$2,IF('random picks'!$G118=1,'random picks'!$G$2,IF('random picks'!$H118=1,'random picks'!$H$2,IF('random picks'!$I118=1,'random picks'!$I$2))))))))","v":"STU D"},{"$f":"IF('random picks'!$B118=2,'random picks'!$B$2,IF('random picks'!$C118=2,'random picks'!$C$2,IF('random picks'!$D118=2,'random picks'!$D$2,IF('random picks'!$E118=2,'random picks'!$E$2,IF('random picks'!$F118=2,'random picks'!$F$2,IF('random picks'!$G118=2,'random picks'!$G$2,IF('random picks'!$H118=2,'random picks'!$H$2,IF('random picks'!$I118=2,'random picks'!$I$2))))))))","v":"ANDY W"},{"$f":"IF('random picks'!$B118=3,'random picks'!$B$2,IF('random picks'!$C118=3,'random picks'!$C$2,IF('random picks'!$D118=3,'random picks'!$D$2,IF('random picks'!$E118=3,'random picks'!$E$2,IF('random picks'!$F118=3,'random picks'!$F$2,IF('random picks'!$G118=3,'random picks'!$G$2,IF('random picks'!$H118=3,'random picks'!$H$2,IF('random picks'!$I118=3,'random picks'!$I$2))))))))","v":"CRAIG T"},{"$f":"IF('random picks'!$B118=4,'random picks'!$B$2,IF('random picks'!$C118=4,'random picks'!$C$2,IF('random picks'!$D118=4,'random picks'!$D$2,IF('random picks'!$E118=4,'random picks'!$E$2,IF('random picks'!$F118=4,'random picks'!$F$2,IF('random picks'!$G118=4,'random picks'!$G$2,IF('random picks'!$H118=4,'random picks'!$H$2,IF('random picks'!$I118=4,'random picks'!$I$2))))))))","v":"JOHN C"},{"$f":"IF('random picks'!$B118=5,'random picks'!$B$2,IF('random picks'!$C118=5,'random picks'!$C$2,IF('random picks'!$D118=5,'random picks'!$D$2,IF('random picks'!$E118=5,'random picks'!$E$2,IF('random picks'!$F118=5,'random picks'!$F$2,IF('random picks'!$G118=5,'random picks'!$G$2,IF('random picks'!$H118=5,'random picks'!$H$2,IF('random picks'!$I118=5,'random picks'!$I$2))))))))","v":"MIKE H"},{"$f":"IF('random picks'!$B118=6,'random picks'!$B$2,IF('random picks'!$C118=6,'random picks'!$C$2,IF('random picks'!$D118=6,'random picks'!$D$2,IF('random picks'!$E118=6,'random picks'!$E$2,IF('random picks'!$F118=6,'random picks'!$F$2,IF('random picks'!$G118=6,'random picks'!$G$2,IF('random picks'!$H118=6,'random picks'!$H$2,IF('random picks'!$I118=6,'random picks'!$I$2))))))))","v":"BYRON"},{"$f":"IF('random picks'!$B118=7,'random picks'!$B$2,IF('random picks'!$C118=7,'random picks'!$C$2,IF('random picks'!$D118=7,'random picks'!$D$2,IF('random picks'!$E118=7,'random picks'!$E$2,IF('random picks'!$F118=7,'random picks'!$F$2,IF('random picks'!$G118=7,'random picks'!$G$2,IF('random picks'!$H118=7,'random picks'!$H$2,IF('random picks'!$I118=7,'random picks'!$I$2))))))))","v":"STEVER"},{"$f":"IF('random picks'!$B118=8,'random picks'!$B$2,IF('random picks'!$C118=8,'random picks'!$C$2,IF('random picks'!$D118=8,'random picks'!$D$2,IF('random picks'!$E118=8,'random picks'!$E$2,IF('random picks'!$F118=8,'random picks'!$F$2,IF('random picks'!$G118=8,'random picks'!$G$2,IF('random picks'!$H118=8,'random picks'!$H$2,IF('random picks'!$I118=8,'random picks'!$I$2))))))))","v":"ROB W"}]
["R4",{"$f":"IF('random picks'!$B119=1,'random picks'!$B$2,IF('random picks'!$C119=1,'random picks'!$C$2,IF('random picks'!$D119=1,'random picks'!$D$2,IF('random picks'!$E119=1,'random picks'!$E$2,IF('random picks'!$F119=1,'random picks'!$F$2,IF('random picks'!$G119=1,'random picks'!$G$2,IF('random picks'!$H119=1,'random picks'!$H$2,IF('random picks'!$I119=1,'random picks'!$I$2))))))))","v":"CRAIG T"},{"$f":"IF('random picks'!$B119=2,'random picks'!$B$2,IF('random picks'!$C119=2,'random picks'!$C$2,IF('random picks'!$D119=2,'random picks'!$D$2,IF('random picks'!$E119=2,'random picks'!$E$2,IF('random picks'!$F119=2,'random picks'!$F$2,IF('random picks'!$G119=2,'random picks'!$G$2,IF('random picks'!$H119=2,'random picks'!$H$2,IF('random picks'!$I119=2,'random picks'!$I$2))))))))","v":"BYRON"},{"$f":"IF('random picks'!$B119=3,'random picks'!$B$2,IF('random picks'!$C119=3,'random picks'!$C$2,IF('random picks'!$D119=3,'random picks'!$D$2,IF('random picks'!$E119=3,'random picks'!$E$2,IF('random picks'!$F119=3,'random picks'!$F$2,IF('random picks'!$G119=3,'random picks'!$G$2,IF('random picks'!$H119=3,'random picks'!$H$2,IF('random picks'!$I119=3,'random picks'!$I$2))))))))","v":"JOHN C"},{"$f":"IF('random picks'!$B119=4,'random picks'!$B$2,IF('random picks'!$C119=4,'random picks'!$C$2,IF('random picks'!$D119=4,'random picks'!$D$2,IF('random picks'!$E119=4,'random picks'!$E$2,IF('random picks'!$F119=4,'random picks'!$F$2,IF('random picks'!$G119=4,'random picks'!$G$2,IF('random picks'!$H119=4,'random picks'!$H$2,IF('random picks'!$I119=4,'random picks'!$I$2))))))))","v":"STU D"},{"$f":"IF('random picks'!$B119=5,'random picks'!$B$2,IF('random picks'!$C119=5,'random picks'!$C$2,IF('random picks'!$D119=5,'random picks'!$D$2,IF('random picks'!$E119=5,'random picks'!$E$2,IF('random picks'!$F119=5,'random picks'!$F$2,IF('random picks'!$G119=5,'random picks'!$G$2,IF('random picks'!$H119=5,'random picks'!$H$2,IF('random picks'!$I119=5,'random picks'!$I$2))))))))","v":"MIKE H"},{"$f":"IF('random picks'!$B119=6,'random picks'!$B$2,IF('random picks'!$C119=6,'random picks'!$C$2,IF('random picks'!$D119=6,'random picks'!$D$2,IF('random picks'!$E119=6,'random picks'!$E$2,IF('random picks'!$F119=6,'random picks'!$F$2,IF('random picks'!$G119=6,'random picks'!$G$2,IF('random picks'!$H119=6,'random picks'!$H$2,IF('random picks'!$I119=6,'random picks'!$I$2))))))))","v":"ROB W"},{"$f":"IF('random picks'!$B119=7,'random picks'!$B$2,IF('random picks'!$C119=7,'random picks'!$C$2,IF('random picks'!$D119=7,'random picks'!$D$2,IF('random picks'!$E119=7,'random picks'!$E$2,IF('random picks'!$F119=7,'random picks'!$F$2,IF('random picks'!$G119=7,'random picks'!$G$2,IF('random picks'!$H119=7,'random picks'!$H$2,IF('random picks'!$I119=7,'random picks'!$I$2))))))))","v":"STEVER"},{"$f":"IF('random picks'!$B119=8,'random picks'!$B$2,IF('random picks'!$C119=8,'random picks'!$C$2,IF('random picks'!$D119=8,'random picks'!$D$2,IF('random picks'!$E119=8,'random picks'!$E$2,IF('random picks'!$F119=8,'random picks'!$F$2,IF('random picks'!$G119=8,'random picks'!$G$2,IF('random picks'!$H119=8,'random picks'!$H$2,IF('random picks'!$I119=8,'random picks'!$I$2))))))))","v":"ANDY W"}]
["R5",{"$f":"IF('random picks'!$B120=1,'random picks'!$B$2,IF('random picks'!$C120=1,'random picks'!$C$2,IF('random picks'!$D120=1,'random picks'!$D$2,IF('random picks'!$E120=1,'random picks'!$E$2,IF('random picks'!$F120=1,'random picks'!$F$2,IF('random picks'!$G120=1,'random picks'!$G$2,IF('random picks'!$H120=1,'random picks'!$H$2,IF('random picks'!$I120=1,'random picks'!$I$2))))))))","v":"ANDY W"},{"$f":"IF('random picks'!$B120=2,'random picks'!$B$2,IF('random picks'!$C120=2,'random picks'!$C$2,IF('random picks'!$D120=2,'random picks'!$D$2,IF('random picks'!$E120=2,'random picks'!$E$2,IF('random picks'!$F120=2,'random picks'!$F$2,IF('random picks'!$G120=2,'random picks'!$G$2,IF('random picks'!$H120=2,'random picks'!$H$2,IF('random picks'!$I120=2,'random picks'!$I$2))))))))","v":"BYRON"},{"$f":"IF('random picks'!$B120=3,'random picks'!$B$2,IF('random picks'!$C120=3,'random picks'!$C$2,IF('random picks'!$D120=3,'random picks'!$D$2,IF('random picks'!$E120=3,'random picks'!$E$2,IF('random picks'!$F120=3,'random picks'!$F$2,IF('random picks'!$G120=3,'random picks'!$G$2,IF('random picks'!$H120=3,'random picks'!$H$2,IF('random picks'!$I120=3,'random picks'!$I$2))))))))","v":"STU D"},{"$f":"IF('random picks'!$B120=4,'random picks'!$B$2,IF('random picks'!$C120=4,'random picks'!$C$2,IF('random picks'!$D120=4,'random picks'!$D$2,IF('random picks'!$E120=4,'random picks'!$E$2,IF('random picks'!$F120=4,'random picks'!$F$2,IF('random picks'!$G120=4,'random picks'!$G$2,IF('random picks'!$H120=4,'random picks'!$H$2,IF('random picks'!$I120=4,'random picks'!$I$2))))))))","v":"JOHN C"},{"$f":"IF('random picks'!$B120=5,'random picks'!$B$2,IF('random picks'!$C120=5,'random picks'!$C$2,IF('random picks'!$D120=5,'random picks'!$D$2,IF('random picks'!$E120=5,'random picks'!$E$2,IF('random picks'!$F120=5,'random picks'!$F$2,IF('random picks'!$G120=5,'random picks'!$G$2,IF('random picks'!$H120=5,'random picks'!$H$2,IF('random picks'!$I120=5,'random picks'!$I$2))))))))","v":"MIKE H"},{"$f":"IF('random picks'!$B120=6,'random picks'!$B$2,IF('random picks'!$C120=6,'random picks'!$C$2,IF('random picks'!$D120=6,'random picks'!$D$2,IF('random picks'!$E120=6,'random picks'!$E$2,IF('random picks'!$F120=6,'random picks'!$F$2,IF('random picks'!$G120=6,'random picks'!$G$2,IF('random picks'!$H120=6,'random picks'!$H$2,IF('random picks'!$I120=6,'random picks'!$I$2))))))))","v":"STEVER"},{"$f":"IF('random picks'!$B120=7,'random picks'!$B$2,IF('random picks'!$C120=7,'random picks'!$C$2,IF('random picks'!$D120=7,'random picks'!$D$2,IF('random picks'!$E120=7,'random picks'!$E$2,IF('random picks'!$F120=7,'random picks'!$F$2,IF('random picks'!$G120=7,'random picks'!$G$2,IF('random picks'!$H120=7,'random picks'!$H$2,IF('random picks'!$I120=7,'random picks'!$I$2))))))))","v":"ROB W"},{"$f":"IF('random picks'!$B120=8,'random picks'!$B$2,IF('random picks'!$C120=8,'random picks'!$C$2,IF('random picks'!$D120=8,'random picks'!$D$2,IF('random picks'!$E120=8,'random picks'!$E$2,IF('random picks'!$F120=8,'random picks'!$F$2,IF('random picks'!$G120=8,'random picks'!$G$2,IF('random picks'!$H120=8,'random picks'!$H$2,IF('random picks'!$I120=8,'random picks'!$I$2))))))))","v":"CRAIG T"}]

{"sheet":"BLANKS","index":2,"n_rows":40,"n_cols":8,"rows_kept":40,"cut":false,"hidden":false,"merged":[]}
["US MASTERS 2017"]
[]
["Day 0"]
[]
[{"$f":"results!A7","v":"BYRON"},"Pick",null,{"$f":"results!G7","v":"ROB W"},"Pick",null,{"$f":"results!M7","v":0},"Pick"]
[null,{"$f":"SUM(B7:B11)/5","v":3.2},null,null,{"$f":"SUM(E7:E11)/5","v":6},null,null,{"$f":"SUM(H7:H11)/5","v":0}]
["Rory McIlroy",{"$f":"'random picks'!B116","v":3},null,"Justin Rose",{"$f":"'random picks'!F116","v":7},null,null,{"$f":"'random picks'!J116","v":0}]
["Henrik Stenson",{"$f":"'random picks'!B117","v":3},null,"Jon Rahm",{"$f":"'random picks'!F117","v":2},null,null,{"$f":"'random picks'!J117","v":0}]
["Matthew Fitzpatrick",{"$f":"'random picks'!B118","v":6},null,"Marc Leishman",{"$f":"'random picks'!F118","v":8},null,null,{"$f":"'random picks'!J118","v":0}]
["Adam Hadwin",{"$f":"'random picks'!B119","v":2},null,"Lee Westwood",{"$f":"'random picks'!F119","v":6},null,null,{"$f":"'random picks'!J119","v":0}]
{"$rows_left_out":31}
{"sheet":"ranks","index":3,"n_rows":45,"n_cols":7,"rows_kept":45,"cut":false,"hidden":false,"merged":[]}
[null,null,"Positions"]
[]
["row","col","Player","Score","Score adj","Rank","Rank adj"]
[1,1,{"$f":"INDEX(results!$A$7:$Q$42,$A4,$B4)","v":"BYRON"},{"$f":"INDEX(results!$A$7:$Q$42,$A4+6,$B4+2)","v":11},{"$f":"INDEX(results!$A$7:$Q$42,$A4+6,$B4+3)","v":10.968},{"$f":"IF(ISERROR(RANK(D4,$D$4:$D$14,1)),\"\",RANK(D4,$D$4:$D$14,1))","v":7},{"$f":"IF(ISERROR(RANK(E4,$E$4:$E$14,1)),\"\",RANK(E4,$E$4:$E$14,1))","v":7}]
[{"$f":"A4+9","v":10},1,{"$f":"INDEX(results!$A$7:$Q$42,$A5,$B5)","v":"JOHN C"},{"$f":"INDEX(results!$A$7:$Q$42,$A5+6,$B5+2)","v":3},{"$f":"INDEX(results!$A$7:$Q$42,$A5+6,$B5+3)","v":2.956},4,{"$f":"IF(ISERROR(RANK(E5,$E$4:$E$14,1)),\"\",RANK(E5,$E$4:$E$14,1))","v":4}]
[{"$f":"A5+9","v":19},1,{"$f":"INDEX(results!$A$7:$Q$42,$A6,$B6)","v":"MIKE H"},{"$f":"INDEX(results!$A$7:$Q$42,$A6+6,$B6+2)","v":4},{"$f":"INDEX(results!$A$7:$Q$42,$A6+6,$B6+3)","v":3.9540000000000002},5,5]
[{"$f":"A6+9","v":28},1,{"$f":"INDEX(results!$A$7:$Q$42,$A7,$B7)","v":"STEVER"},{"$f":"INDEX(results!$A$7:$Q$42,$A7+6,$B7+2)","v":2},{"$f":"INDEX(results!$A$7:$Q$42,$A7+6,$B7+3)","v":1.9419999999999999},3,3]
[1,{"$f":"B4+6","v":7},{"$f":"INDEX(results!$A$7:$Q$42,$A8,$B8)","v":"ROB W"},{"$f":"INDEX(results!$A$7:$Q$42,$A8+6,$B8+2)","v":-6},{"$f":"INDEX(results!$A$7:$Q$42,$A8+6,$B8+3)","v":-6.06},1,1]
[{"$f":"A8+9","v":10},7,{"$f":"INDEX(results!$A$7:$Q$42,$A9,$B9)","v":"CRAIG T"},{"$f":"INDEX(results!$A$7:$Q$42,$A9+6,$B9+2)","v":0},{"$f":"INDEX(results!$A$7:$Q$42,$A9+6,$B9+3)","v":-4.2000000000000003E-2},2,2]
[{"$f":"A9+9","v":19},7,{"$f":"INDEX(results!$A$7:$Q$42,$A10,$B10)","v":"ANDY W"},{"$f":"INDEX(results!$A$7:$Q$42,$A10+6,$B10+2)","v":8},{"$f":"INDEX(results!$A$7:$Q$42,$A10+6,$B10+3)","v":7.96},6,6]
{"$rows_left_out":36}
{"sheet":"PAYERS","index":4,"n_rows":9,"n_cols":5,"rows_kept":9,"cut":false,"hidden":false,"merged":[]}
["WHO","PAID","TO PAY","ATTEND","PICKS"]
[{"$f":"results!A7","v":"BYRON"},"NO","YES","YES","NO"]
[{"$f":"results!A16","v":"JOHN C"},"NO","YES","YES","NO"]
[{"$f":"results!A25","v":"MIKE H"},"NO","YES","YES","NO"]
[{"$f":"results!A34","v":"STEVER"},"NO","YES","YES","NO"]
[{"$f":"results!G7","v":"ROB W"},"NO","YES","YES","NO"]
[{"$f":"results!G16","v":"CRAIG T"},"NO","YES","NO","NO"]
[{"$f":"results!G25","v":"ANDY W"},"NO","YES","YES","NO"]
[{"$f":"results!G34","v":"STU D"},"NO","YES","NO","NO"]

{"sheet":"webquery","index":5,"n_rows":159,"n_cols":23,"rows_kept":159,"cut":false,"hidden":false,"merged":[]}
[1,2,3,4,5,6,7,8,9,10,null,null,11,null,null,null,10,null,11,12,13,14,15]
[null,"from","https://www.msn.com/en-us/sports/golf/leaderboard",null,null,null,null,null,null,null,null,null,null,null,null,null,null,"Index:",3,4,6,5]
[null,"2017 Round 1",null,null,null,null,null,null,null,null,null,null,null,null,null,null,null,null,null,"total","t-off","thru"]
[null,"Pos","Name","Total","Thru","Today","R1","R2","R3","R4","S","Strokes",null,null,null,null,null,1,{"$f":"SUBSTITUTE(INDEX($A$4:$J$159,R4,$S$2),\"*\",\"\")","v":"Name"},{"$f":"IF(SUBSTITUTE(INDEX($A$4:$L$159,R4,$T$2),\"+\",\"\")=\"E\",0,IF(SUBSTITUTE(INDEX($A$4:$L$159,R4,$T$2),\"+\",\"\")=\"MC\",100,SUBSTITUTE(INDEX($A$4:$L$159,R4,$T$2),\"+\",\"\")))","v":"Total"},{"$f":"IF(ISERROR(INDEX($A$4:$J$159,R4,$U$2)+TIME(5,0,0)),\"\",INDEX($A$4:$J$159,R4,$U$2)+TIME(5,0,0))","v":""},{"$f":"INDEX($A$4:$N$159,R4,$V$2)","v":"Thru"}]
[null,1,"Charley Hoffman","-4","18","3","65","75","-","-","140","-",null,null,null,null,null,2,{"$f":"SUBSTITUTE(INDEX($A$4:$J$159,R5,$S$2),\"*\",\"\")","v":"Charley Hoffman"},{"$f":"IF(SUBSTITUTE(INDEX($A$4:$L$159,R5,$T$2),\"+\",\"\")=\"E\",0,IF(SUBSTITUTE(INDEX($A$4:$L$159,R5,$T$2),\"+\",\"\")=\"MC\",100,SUBSTITUTE(INDEX($A$4:$L$159,R5,$T$2),\"+\",\"\")))","v":"-4"},{"$f":"IF(ISERROR(INDEX($A$4:$J$159,R5,$U$2)+TIME(5,0,0)),\"\",INDEX($A$4:$J$159,R5,$U$2)+TIME(5,0,0))","v":3.2083333333333335},{"$f":"INDEX($A$4:$N$159,R5,$V$2)","v":"18"}]
[null,1,"Sergio Garcia","-4","18","-3","71","69","-","-","140","-",null,null,null,null,null,3,"Sergio Garcia","-4",-2.7916666666666665,"18"]
[null,1,"Thomas Pieters","-4","18","-4","72","68","-","-","140","-",null,null,null,null,null,4,"Thomas Pieters","-4",-3.7916666666666665,"18"]
[null,1,"Rickie Fowler","-4","18","-5","73","67","-","-","140","-",null,null,null,null,null,5,"Rickie Fowler","-4",-4.791666666666667,"18"]
[null,5,"William McGirt","-2","18","1","69","73","-","-","142","-",null,null,null,null,null,6,"William McGirt","-2",1.2083333333333333,"18"]
[null,6,"Ryan Moore","-1","18","-3","74","69","-","-","143","-",null,null,null,null,null,7,"Ryan Moore","-1",-2.7916666666666665,"18"]
{"$rows_left_out":150}
{"sheet":"results","index":6,"n_rows":44,"n_cols":17,"rows_kept":44,"cut":false,"hidden":false,"merged":[]}
["US MASTERS 2017"]
[]
[]
["Day",1]
[]
[null,"Pick","Total","Hole","T off time",null,null,"Pick","Total","Hole","T off time",null,null,"Pick","Total","Hole","T off time"]
[{"$f":"'random picks'!B2","v":"BYRON"},{"$f":"SUM(B8:B12)/5","v":3.2},null,null,null,null,{"$f":"'random picks'!F2","v":"ROB W"},{"$f":"SUM(H8:H12)/5","v":6},null,null,null,null,{"$f":"'random picks'!J2","v":0},{"$f":"SUM(N8:N12)/5","v":0}]
[{"$f":"BLANKS!A7","v":"Rory McIlroy"},{"$f":"BLANKS!B7","v":3},{"$f":"VALUE(IF($A8=\"\",\"\",VLOOKUP($A8,webquery!S:V,2,FALSE)))","v":1},{"$f":"VLOOKUP($A8,webquery!$S:V,4,FALSE)","v":"18"},1.5,null,{"$f":"BLANKS!D7","v":"Justin Rose"},{"$f":"BLANKS!E7","v":7},{"$f":"VALUE(IF($G8=\"\",\"\",VLOOKUP($G8,webquery!S:V,2,FALSE)))","v":-1},{"$f":"VLOOKUP($G8,webquery!$S:$V,4,FALSE)","v":"18"},1.5,null,{"$f":"BLANKS!G7","v":0},{"$f":"BLANKS!H7","v":0},{"$f":"IF($M8=\"\",\"\",VLOOKUP($M8,webquery!S:V,2,FALSE))","v":{"$error":"#N/A"}},{"$f":"IF(Q8<1,\"\",VLOOKUP($M8,webquery!$S:$V,4,FALSE))","v":{"$error":"#N/A"}},1.5]
[{"$f":"BLANKS!A8","v":"Henrik Stenson"},{"$f":"BLANKS!B8","v":3},{"$f":"VALUE(IF($A9=\"\",\"\",VLOOKUP($A9,webquery!S:V,2,FALSE)))","v":8},{"$f":"VLOOKUP($A9,webquery!$S:V,4,FALSE)","v":"18"},1.5,null,{"$f":"BLANKS!D8","v":"Jon Rahm"},{"$f":"BLANKS!E8","v":2},{"$f":"VALUE(IF($G9=\"\",\"\",VLOOKUP($G9,webquery!S:V,2,FALSE)))","v":-1},{"$f":"VLOOKUP($G9,webquery!$S:$V,4,FALSE)","v":"18"},1.5,null,{"$f":"BLANKS!G8","v":0},{"$f":"BLANKS!H8","v":0},{"$f":"IF($M9=\"\",\"\",VLOOKUP($M9,webquery!S:V,2,FALSE))","v":{"$error":"#N/A"}},{"$f":"IF(Q9<1,\"\",VLOOKUP($M9,webquery!$S:$V,4,FALSE))","v":{"$error":"#N/A"}},1.5]
[{"$f":"BLANKS!A9","v":"Matthew Fitzpatrick"},{"$f":"BLANKS!B9","v":6},{"$f":"VALUE(IF($A10=\"\",\"\",VLOOKUP($A10,webquery!S:V,2,FALSE)))","v":5},{"$f":"VLOOKUP($A10,webquery!$S:V,4,FALSE)","v":"18"},1.5,null,{"$f":"BLANKS!D9","v":"Marc Leishman"},{"$f":"BLANKS!E9","v":8},{"$f":"VALUE(IF($G10=\"\",\"\",VLOOKUP($G10,webquery!S:V,2,FALSE)))","v":3},{"$f":"VLOOKUP($G10,webquery!$S:$V,4,FALSE)","v":"18"},1.5,null,{"$f":"BLANKS!G9","v":0},{"$f":"BLANKS!H9","v":0},{"$f":"IF($M10=\"\",\"\",VLOOKUP($M10,webquery!S:V,2,FALSE))","v":{"$error":"#N/A"}},{"$f":"IF(Q10<1,\"\",VLOOKUP($M10,webquery!$S:$V,4,FALSE))","v":{"$error":"#N/A"}},1.5]
{"$rows_left_out":34}