{"text_format":"1","workbook":"xlsx","n_sheets":7,"sheets":["results","webquery","ranks","BLANKS","PAYERS","random picks","Round order"],"not_rendered":{"charts":0,"images":1,"macros":1,"external_links":0,"defined_names":1,"comments":0,"pivot_tables":0},"unopened":[],"bounds":{"document_bytes":16777216,"sheet_cells":100000,"rows_first":2000,"rows_last":500,"rows_between":2000,"halvings":0,"cell_chars":16384,"cell_head_chars":4096},"cells_cut":0,"cells_raw":0,"read":"whole","date_system":"1900"}

{"sheet":"results","index":0,"n_rows":44,"n_cols":17,"rows_kept":44,"cut":false,"hidden":false,"merged":[]}
["The US PGA 2014"]
[]
[]
["Day",0]
[]
[null,"Pick","Total","Hole","T off time",null,null,"Pick","Total","Hole","T off time",null,null,"Pick","Total","Hole","T off time"]
[{"$f":"'random picks'!B2","v":"DEANO"},{"$f":"SUM(B8:B12)/5","v":4.4000000000000004},null,null,null,null,{"$f":"'random picks'!F2","v":"JOHN C"},{"$f":"SUM(H8:H12)/5","v":3},null,null,null,null,{"$f":"'random picks'!J2","v":0},{"$f":"SUM(N8:N12)/5","v":0}]
[{"$f":"BLANKS!A8","v":"Rickie Fowler"},{"$f":"BLANKS!B8","v":3},{"$f":"IF($A8=\"\",\"\",VLOOKUP($A8,webquery!S:V,2,FALSE))","v":-11},{"$f":"IF(E8<1,\"\",VLOOKUP($A8,webquery!$S:V,4,FALSE))","v":"F"},1.5,null,{"$f":"BLANKS!D8","v":"Sergio Garcia"},{"$f":"BLANKS!E8","v":5},{"$f":"IF($G8=\"\",\"\",VLOOKUP($G8,webquery!S:V,2,FALSE))","v":-5},{"$f":"IF(K8<1,\"\",VLOOKUP($G8,webquery!$S:$V,4,FALSE))","v":"F"},1.5,null,{"$f":"BLANKS!G8","v":0},{"$f":"BLANKS!H8","v":0},{"$f":"IF($M8=\"\",\"\",VLOOKUP($M8,webquery!S:V,2,FALSE))","v":{"$error":"#N/A"}},{"$f":"IF(Q8<1,\"\",VLOOKUP($M8,webquery!$S:$V,4,FALSE))","v":{"$error":"#N/A"}},1.5]
{"$rows_left_out":37}
{"sheet":"webquery","index":1,"n_rows":162,"n_cols":23,"rows_kept":162,"cut":false,"hidden":false,"merged":[]}
[1,2,3,4,5,6,7,8,9,10,null,null,11,null,null,null,10,null,11,12,13,14,15]
[null,null,null,null,null,null,null,null,null,null,null,null,null,null,null,null,null,"Index:",3,10,6,9]
[null,null,"Search Sports",null,null,null,null,null,null,null,null,null,null,null,null,null,null,null,null,"total","t-off","thru"]
[null,null,"Search Web",null,null,null,null,null,null,null,null,null,null,null,null,null,null,4,{"$f":"SUBSTITUTE(INDEX($A:$J,R4,$S$2),\"*\",\"\")","v":"Search Web"},{"$f":"IF(INDEX($A:$L,R4,$T$2)=\"E\",0,IF(INDEX($A:$L,R4,$T$2)=\"MC\",100,INDEX($A:$L,R4,$T$2)))","v":0},{"$f":"IF(ISERROR(INDEX($A:$J,R4,$U$2)+TIME(5,0,0)),\"\",INDEX($A:$J,R4,$U$2)+TIME(5,0,0))","v":"05:00:00"},{"$f":"INDEX($A:$N,R4,$V$2)","v":0}]
[null,null,null,null,null,null,null,null,null,null,null,null,null,null,null,null,null,5,{"$f":"SUBSTITUTE(INDEX($A:$J,R5,$S$2),\"*\",\"\")","v":""},{"$f":"IF(INDEX($A:$L,R5,$T$2)=\"E\",0,IF(INDEX($A:$L,R5,$T$2)=\"MC\",100,INDEX($A:$L,R5,$T$2)))","v":0},{"$f":"IF(ISERROR(INDEX($A:$J,R5,$U$2)+TIME(5,0,0)),\"\",INDEX($A:$J,R5,$U$2)+TIME(5,0,0))","v":"05:00:00"},{"$f":"INDEX($A:$N,R5,$V$2)","v":0}]
[null,"Pos","Name",1,2,3,4,"Today","Thru","Total","Strokes",null,null,null,null,null,null,6,{"$f":"SUBSTITUTE(INDEX($A:$J,R6,$S$2),\"*\",\"\")","v":"Name"},{"$f":"IF(INDEX($A:$L,R6,$T$2)=\"E\",0,IF(INDEX($A:$L,R6,$T$2)=\"MC\",100,INDEX($A:$L,R6,$T$2)))","v":"Total"},{"$f":"IF(ISERROR(INDEX($A:$J,R6,$U$2)+TIME(5,0,0)),\"\",INDEX($A:$J,R6,$U$2)+TIME(5,0,0))","v":3.2083333333333335},{"$f":"INDEX($A:$N,R6,$V$2)","v":"Thru"}]
[null,1,"Rory McIlroy",66,67,67,"14:55:00",-4,"F",-13,200,null,null,null,null,null,null,7,{"$f":"SUBSTITUTE(INDEX($A:$J,R7,$S$2),\"*\",\"\")","v":"Rory McIlroy"},{"$f":"IF(INDEX($A:$L,R7,$T$2)=\"E\",0,IF(INDEX($A:$L,R7,$T$2)=\"MC\",100,INDEX($A:$L,R7,$T$2)))","v":-13},{"$f":"IF(ISERROR(INDEX($A:$J,R7,$U$2)+TIME(5,0,0)),\"\",INDEX($A:$J,R7,$U$2)+TIME(5,0,0))","v":67.208333333333329},{"$f":"INDEX($A:$N,R7,$V$2)","v":"F"}]
[null,2,"Bernd Wiesberger",68,68,65,"14:55:00",-6,"F",-12,201,null,null,null,null,null,null,{"$f":"R7+1","v":8},{"$f":"SUBSTITUTE(INDEX($A:$J,R8,$S$2),\"*\",\"\")","v":"Bernd Wiesberger"},{"$f":"IF(INDEX($A:$L,R8,$T$2)=\"E\",0,IF(INDEX($A:$L,R8,$T$2)=\"MC\",100,INDEX($A:$L,R8,$T$2)))","v":-12},{"$f":"IF(ISERROR(INDEX($A:$J,R8,$U$2)+TIME(5,0,0)),\"\",INDEX($A:$J,R8,$U$2)+TIME(5,0,0))","v":65.208333333333329},{"$f":"INDEX($A:$N,R8,$V$2)","v":"F"}]
{"$rows_left_out":155}
{"sheet":"ranks","index":2,"n_rows":45,"n_cols":14,"rows_kept":45,"cut":false,"hidden":false,"merged":[]}
[null,null,"Positions"]
[]
["row","col","Player","Score","Score adj","Rank","Rank adj"]
[1,1,{"$f":"INDEX(results!$A$7:$Q$42,$A4,$B4)","v":"DEANO"},{"$f":"INDEX(results!$A$7:$Q$42,$A4+6,$B4+2)","v":-12},{"$f":"INDEX(results!$A$7:$Q$42,$A4+6,$B4+3)","v":-12.044},{"$f":"IF(ISERROR(RANK(D4,$D$4:$D$14,1)),\"\",RANK(D4,$D$4:$D$14,1))","v":6},{"$f":"IF(ISERROR(RANK(E4,$E$4:$E$14,1)),\"\",RANK(E4,$E$4:$E$14,1))","v":6},null,"round 1","Player","Score","Score adj","Rank","Rank adj"]
[{"$f":"A4+9","v":10},1,{"$f":"INDEX(results!$A$7:$Q$42,$A5,$B5)","v":"TEZ"},{"$f":"INDEX(results!$A$7:$Q$42,$A5+6,$B5+2)","v":-19},{"$f":"INDEX(results!$A$7:$Q$42,$A5+6,$B5+3)","v":-19.033999999999999},4,{"$f":"IF(ISERROR(RANK(E5,$E$4:$E$14,1)),\"\",RANK(E5,$E$4:$E$14,1))","v":5},null,null,"BYRON",-9,-9.048,1,1]
[{"$f":"A5+9","v":19},1,{"$f":"INDEX(results!$A$7:$Q$42,$A6,$B6)","v":"BYRON"},{"$f":"INDEX(results!$A$7:$Q$42,$A6+6,$B6+2)","v":-21},{"$f":"INDEX(results!$A$7:$Q$42,$A6+6,$B6+3)","v":-21.047999999999998},2,2,null,null,"STEVER",-8,-8.0459999999999994,2,2]
[{"$f":"A6+9","v":28},1,{"$f":"INDEX(results!$A$7:$Q$42,$A7,$B7)","v":"STEVER"},{"$f":"INDEX(results!$A$7:$Q$42,$A7+6,$B7+2)","v":-19},{"$f":"INDEX(results!$A$7:$Q$42,$A7+6,$B7+3)","v":-19.045999999999999},4,4,null,null,"CRAIG T",-7,-7.0380000000000003,3,3]
[1,{"$f":"B4+6","v":7},{"$f":"INDEX(results!$A$7:$Q$42,$A8,$B8)","v":"JOHN C"},{"$f":"INDEX(results!$A$7:$Q$42,$A8+6,$B8+2)","v":-23},{"$f":"INDEX(results!$A$7:$Q$42,$A8+6,$B8+3)","v":-23.03},1,1,null,null,"TEZ",-7,-7.0339999999999998,3,4]
{"$rows_left_out":38}
{"sheet":"BLANKS","index":3,"n_rows":41,"n_cols":8,"rows_kept":41,"cut":false,"hidden":false,"merged":[]}
["The US PGA 2014"]
[]
[]
["Day 0"]
[]
[{"$f":"results!A7","v":"DEANO"},"Pick",null,{"$f":"results!G7","v":"JOHN C"},"Pick",null,{"$f":"results!M7","v":0},"Pick"]
[null,{"$f":"SUM(B8:B12)/5","v":4.4000000000000004},null,null,{"$f":"SUM(E8:E12)/5","v":3},null,null,{"$f":"SUM(H8:H12)/5","v":0}]
["Rickie Fowler",{"$f":"'random picks'!B90","v":3},null,"Sergio Garcia",{"$f":"'random picks'!F90","v":5},null,null,{"$f":"'random picks'!J90","v":0}]
{"$rows_left_out":34}
{"sheet":"PAYERS","index":4,"n_rows":10,"n_cols":5,"rows_kept":10,"cut":false,"hidden":false,"merged":[]}
["WHO","PAID","TO PAY","ATTEND","PICKS"]
[]
[{"$f":"results!A7","v":"DEANO"},"NO","YES","YES","-"]
[{"$f":"results!A16","v":"TEZ"},"YES",null,"YES","-"]
[{"$f":"results!A25","v":"BYRON"},"NO","YES","NO","NO"]
[{"$f":"results!A34","v":"STEVER"},"NO","YES","YES","-"]
[{"$f":"results!G7","v":"JOHN C"},"NO","YES","NO","NO"]
[{"$f":"results!G16","v":"CRAIG T"},"YES",null,"NO","NO"]
{"$rows_left_out":3}
{"sheet":"random picks","index":5,"n_rows":109,"n_cols":16,"rows_kept":109,"cut":false,"hidden":false,"merged":[]}
[]
[null,"DEANO","TEZ","BYRON","STEVER","JOHN C","CRAIG T","STUART D"]
["Random number generator for pick order"]
["R1",{"$f":"RAND()","v":0.99763416230798196},0.70434032056060647,0.96263451243283782,0.10354722468304323,0.89620581074232875,0.17871646130934604,0.18689602287991958,0.1162253320642096,1.2438289747082276E-2,0.76772824074035706]
["R2",0.12001521835347195,0.55609372933405365,0.54770966200385818,6.1124397385721396E-2,0.17159727740793596,0.84456073108882335,0.55371882105309955,0.46433113706564788,0.54132433041971861,0.8065169607206053]
["R3",0.3086854771403732,7.1317175297548996E-2,0.64431973266639908,0.88367328541384382,0.52408301892587905,0.7652470755146541,0.6869962228381874,6.8336150851349919E-2,0.15884075929989105,0.44670686962452866]
["R4",0.33440822598267206,0.4509332444589782,0.48052483737679685,0.63647283862906567,0.91003088394212295,0.8005355833020853,5.3608179561971836E-2,0.40609746381799561,0.69849657145269728,0.73012785869884589]
["R5",0.47782591205439118,0.53236946307875355,4.2178442068282251E-2,0.96488729191408462,0.51943536231996468,0.1664761033427028,0.49148426430697856,6.7380945985922147E-2,0.25821639465164459,0.78529732774242889]
{"$rows_left_out":102}
{"sheet":"Round order","index":6,"n_rows":6,"n_cols":9,"rows_kept":6,"cut":false,"hidden":false,"merged":[]}
[null,1,2,3,4,5,6,7,8]
["R1",{"$f":"IF('random picks'!$B90=1,'random picks'!$B$78,IF('random picks'!$C90=1,'random picks'!$C$78,IF('random picks'!$D90=1,'random picks'!$D$78,IF('random picks'!$E90=1,'random picks'!$E$78,IF('random picks'!$F90=1,'random picks'!$F$78,IF('random picks'!$G90=1,'random picks'!$G$78,IF('random picks'!$H90=1,'random picks'!$H$78,IF('random picks'!$I90=1,'random picks'!$I$78))))))))","v":"STEVER"},{"$f":"IF('random picks'!$B90=2,'random picks'!$B$78,IF('random picks'!$C90=2,'random picks'!$C$78,IF('random picks'!$D90=2,'random picks'!$D$78,IF('random picks'!$E90=2,'random picks'!$E$78,IF('random picks'!$F90=2,'random picks'!$F$78,IF('random picks'!$G90=2,'random picks'!$G$78,IF('random picks'!$H90=2,'random picks'!$H$78,IF('random picks'!$I90=2,'random picks'!$I$78))))))))","v":"STUART D"},{"$f":"IF('random picks'!$B90=3,'random picks'!$B$78,IF('random picks'!$C90=3,'random picks'!$C$78,IF('random picks'!$D90=3,'random picks'!$D$78,IF('random picks'!$E90=3,'random picks'!$E$78,IF('random picks'!$F90=3,'random picks'!$F$78,IF('random picks'!$G90=3,'random picks'!$G$78,IF('random picks'!$H90=3,'random picks'!$H$78,IF('random picks'!$I90=3,'random picks'!$I$78))))))))","v":"DEANO"},{"$f":"IF('random picks'!$B90=4,'random picks'!$B$78,IF('random picks'!$C90=4,'random picks'!$C$78,IF('random picks'!$D90=4,'random picks'!$D$78,IF('random picks'!$E90=4,'random picks'!$E$78,IF('random picks'!$F90=4,'random picks'!$F$78,IF('random picks'!$G90=4,'random picks'!$G$78,IF('random picks'!$H90=4,'random picks'!$H$78,IF('random picks'!$I90=4,'random picks'!$I$78))))))))","v":"TEZ"},{"$f":"IF('random picks'!$B90=5,'random picks'!$B$78,IF('random picks'!$C90=5,'random picks'!$C$78,IF('random picks'!$D90=5,'random picks'!$D$78,IF('random picks'!$E90=5,'random picks'!$E$78,IF('random picks'!$F90=5,'random picks'!$F$78,IF('random picks'!$G90=5,'random picks'!$G$78,IF('random picks'!$H90=5,'random picks'!$H$78,IF('random picks'!$I90=5,'random picks'!$I$78))))))))","v":"JOHN C"},{"$f":"IF('random picks'!$B90=6,'random picks'!$B$78,IF('random picks'!$C90=6,'random picks'!$C$78,IF('random picks'!$D90=6,'random picks'!$D$78,IF('random picks'!$E90=6,'random picks'!$E$78,IF('random picks'!$F90=6,'random picks'!$F$78,IF('random picks'!$G90=6,'random picks'!$G$78,IF('random picks'!$H90=6,'random picks'!$H$78,IF('random picks'!$I90=6,'random picks'!$I$78))))))))","v":"CRAIG T"},{"$f":"IF('random picks'!$B90=7,'random picks'!$B$78,IF('random picks'!$C90=7,'random picks'!$C$78,IF('random picks'!$D90=7,'random picks'!$D$78,IF('random picks'!$E90=7,'random picks'!$E$78,IF('random picks'!$F90=7,'random picks'!$F$78,IF('random picks'!$G90=7,'random picks'!$G$78,IF('random picks'!$H90=7,'random picks'!$H$78,IF('random picks'!$I90=7,'random picks'!$I$78))))))))","v":"BYRON"},{"$f":"IF('random picks'!$B90=8,'random picks'!$B$78,IF('random picks'!$C90=8,'random picks'!$C$78,IF('random picks'!$D90=8,'random picks'!$D$78,IF('random picks'!$E90=8,'random picks'!$E$78,IF('random picks'!$F90=8,'random picks'!$F$78,IF('random picks'!$G90=8,'random picks'!$G$78,IF('random picks'!$H90=8,'random picks'!$H$78,IF('random picks'!$I90=8,'random picks'!$I$78))))))))","v":false}]
["R2",{"$f":"IF('random picks'!$B91=1,'random picks'!$B$78,IF('random picks'!$C91=1,'random picks'!$C$78,IF('random picks'!$D91=1,'random picks'!$D$78,IF('random picks'!$E91=1,'random picks'!$E$78,IF('random picks'!$F91=1,'random picks'!$F$78,IF('random picks'!$G91=1,'random picks'!$G$78,IF('random picks'!$H91=1,'random picks'!$H$78,IF('random picks'!$I91=1,'random picks'!$I$78))))))))","v":"TEZ"},{"$f":"IF('random picks'!$B91=2,'random picks'!$B$78,IF('random picks'!$C91=2,'random picks'!$C$78,IF('random picks'!$D91=2,'random picks'!$D$78,IF('random picks'!$E91=2,'random picks'!$E$78,IF('random picks'!$F91=2,'random picks'!$F$78,IF('random picks'!$G91=2,'random picks'!$G$78,IF('random picks'!$H91=2,'random picks'!$H$78,IF('random picks'!$I91=2,'random picks'!$I$78))))))))","v":"STEVER"},{"$f":"IF('random picks'!$B91=3,'random picks'!$B$78,IF('random picks'!$C91=3,'random picks'!$C$78,IF('random picks'!$D91=3,'random picks'!$D$78,IF('random picks'!$E91=3,'random picks'!$E$78,IF('random picks'!$F91=3,'random picks'!$F$78,IF('random picks'!$G91=3,'random picks'!$G$78,IF('random picks'!$H91=3,'random picks'!$H$78,IF('random picks'!$I91=3,'random picks'!$I$78))))))))","v":"JOHN C"},{"$f":"IF('random picks'!$B91=4,'random picks'!$B$78,IF('random picks'!$C91=4,'random picks'!$C$78,IF('random picks'!$D91=4,'random picks'!$D$78,IF('random picks'!$E91=4,'random picks'!$E$78,IF('random picks'!$F91=4,'random picks'!$F$78,IF('random picks'!$G91=4,'random picks'!$G$78,IF('random picks'!$H91=4,'random picks'!$H$78,IF('random picks'!$I91=4,'random picks'!$I$78))))))))","v":"DEANO"},{"$f":"IF('random picks'!$B91=5,'random picks'!$B$78,IF('random picks'!$C91=5,'random picks'!$C$78,IF('random picks'!$D91=5,'random picks'!$D$78,IF('random picks'!$E91=5,'random picks'!$E$78,IF('random picks'!$F91=5,'random picks'!$F$78,IF('random picks'!$G91=5,'random picks'!$G$78,IF('random picks'!$H91=5,'random picks'!$H$78,IF('random picks'!$I91=5,'random picks'!$I$78))))))))","v":"BYRON"},{"$f":"IF('random picks'!$B91=6,'random picks'!$B$78,IF('random picks'!$C91=6,'random picks'!$C$78,IF('random picks'!$D91=6,'random picks'!$D$78,IF('random picks'!$E91=6,'random picks'!$E$78,IF('random picks'!$F91=6,'random picks'!$F$78,IF('random picks'!$G91=6,'random picks'!$G$78,IF('random picks'!$H91=6,'random picks'!$H$78,IF('random picks'!$I91=6,'random picks'!$I$78))))))))","v":"STUART D"},{"$f":"IF('random picks'!$B91=7,'random picks'!$B$78,IF('random picks'!$C91=7,'random picks'!$C$78,IF('random picks'!$D91=7,'random picks'!$D$78,IF('random picks'!$E91=7,'random picks'!$E$78,IF('random picks'!$F91=7,'random picks'!$F$78,IF('random picks'!$G91=7,'random picks'!$G$78,IF('random picks'!$H91=7,'random picks'!$H$78,IF('random picks'!$I91=7,'random picks'!$I$78))))))))","v":"CRAIG T"},{"$f":"IF('random picks'!$B91=8,'random picks'!$B$78,IF('random picks'!$C91=8,'random picks'!$C$78,IF('random picks'!$D91=8,'random picks'!$D$78,IF('random picks'!$E91=8,'random picks'!$E$78,IF('random picks'!$F91=8,'random picks'!$F$78,IF('random picks'!$G91=8,'random picks'!$G$78,IF('random picks'!$H91=8,'random picks'!$H$78,IF('random picks'!$I91=8,'random picks'!$I$78))))))))","v":false}]
["R3",{"$f":"IF('random picks'!$B92=1,'random picks'!$B$78,IF('random picks'!$C92=1,'random picks'!$C$78,IF('random picks'!$D92=1,'random picks'!$D$78,IF('random picks'!$E92=1,'random picks'!$E$78,IF('random picks'!$F92=1,'random picks'!$F$78,IF('random picks'!$G92=1,'random picks'!$G$78,IF('random picks'!$H92=1,'random picks'!$H$78,IF('random picks'!$I92=1,'random picks'!$I$78))))))))","v":"CRAIG T"},{"$f":"IF('random picks'!$B92=2,'random picks'!$B$78,IF('random picks'!$C92=2,'random picks'!$C$78,IF('random picks'!$D92=2,'random picks'!$D$78,IF('random picks'!$E92=2,'random picks'!$E$78,IF('random picks'!$F92=2,'random picks'!$F$78,IF('random picks'!$G92=2,'random picks'!$G$78,IF('random picks'!$H92=2,'random picks'!$H$78,IF('random picks'!$I92=2,'random picks'!$I$78))))))))","v":"JOHN C"},{"$f":"IF('random picks'!$B92=3,'random picks'!$B$78,IF('random picks'!$C92=3,'random picks'!$C$78,IF('random picks'!$D92=3,'random picks'!$D$78,IF('random picks'!$E92=3,'random picks'!$E$78,IF('random picks'!$F92=3,'random picks'!$F$78,IF('random picks'!$G92=3,'random picks'!$G$78,IF('random picks'!$H92=3,'random picks'!$H$78,IF('random picks'!$I92=3,'random picks'!$I$78))))))))","v":"STUART D"},{"$f":"IF('random picks'!$B92=4,'random picks'!$B$78,IF('random picks'!$C92=4,'random picks'!$C$78,IF('random picks'!$D92=4,'random picks'!$D$78,IF('random picks'!$E92=4,'random picks'!$E$78,IF('random picks'!$F92=4,'random picks'!$F$78,IF('random picks'!$G92=4,'random picks'!$G$78,IF('random picks'!$H92=4,'random picks'!$H$78,IF('random picks'!$I92=4,'random picks'!$I$78))))))))","v":"TEZ"},{"$f":"IF('random picks'!$B92=5,'random picks'!$B$78,IF('random picks'!$C92=5,'random picks'!$C$78,IF('random picks'!$D92=5,'random picks'!$D$78,IF('random picks'!$E92=5,'random picks'!$E$78,IF('random picks'!$F92=5,'random picks'!$F$78,IF('random picks'!$G92=5,'random picks'!$G$78,IF('random picks'!$H92=5,'random picks'!$H$78,IF('random picks'!$I92=5,'random picks'!$I$78))))))))","v":"DEANO"},{"$f":"IF('random picks'!$B92=6,'random picks'!$B$78,IF('random picks'!$C92=6,'random picks'!$C$78,IF('random picks'!$D92=6,'random picks'!$D$78,IF('random picks'!$E92=6,'random picks'!$E$78,IF('random picks'!$F92=6,'random picks'!$F$78,IF('random picks'!$G92=6,'random picks'!$G$78,IF('random picks'!$H92=6,'random picks'!$H$78,IF('random picks'!$I92=6,'random picks'!$I$78))))))))","v":"BYRON"},{"$f":"IF('random picks'!$B92=7,'random picks'!$B$78,IF('random picks'!$C92=7,'random picks'!$C$78,IF('random picks'!$D92=7,'random picks'!$D$78,IF('random picks'!$E92=7,'random picks'!$E$78,IF('random picks'!$F92=7,'random picks'!$F$78,IF('random picks'!$G92=7,'random picks'!$G$78,IF('random picks'!$H92=7,'random picks'!$H$78,IF('random picks'!$I92=7,'random picks'!$I$78))))))))","v":"STEVER"},{"$f":"IF('random picks'!$B92=8,'random picks'!$B$78,IF('random picks'!$C92=8,'random picks'!$C$78,IF('random picks'!$D92=8,'random picks'!$D$78,IF('random picks'!$E92=8,'random picks'!$E$78,IF('random picks'!$F92=8,'random picks'!$F$78,IF('random picks'!$G92=8,'random picks'!$G$78,IF('random picks'!$H92=8,'random picks'!$H$78,IF('random picks'!$I92=8,'random picks'!$I$78))))))))","v":false}]
["R4",{"$f":"IF('random picks'!$B93=1,'random picks'!$B$78,IF('random picks'!$C93=1,'random picks'!$C$78,IF('random picks'!$D93=1,'random picks'!$D$78,IF('random picks'!$E93=1,'random picks'!$E$78,IF('random picks'!$F93=1,'random picks'!$F$78,IF('random picks'!$G93=1,'random picks'!$G$78,IF('random picks'!$H93=1,'random picks'!$H$78,IF('random picks'!$I93=1,'random picks'!$I$78))))))))","v":"JOHN C"},{"$f":"IF('random picks'!$B93=2,'random picks'!$B$78,IF('random picks'!$C93=2,'random picks'!$C$78,IF('random picks'!$D93=2,'random picks'!$D$78,IF('random picks'!$E93=2,'random picks'!$E$78,IF('random picks'!$F93=2,'random picks'!$F$78,IF('random picks'!$G93=2,'random picks'!$G$78,IF('random picks'!$H93=2,'random picks'!$H$78,IF('random picks'!$I93=2,'random picks'!$I$78))))))))","v":"CRAIG T"},{"$f":"IF('random picks'!$B93=3,'random picks'!$B$78,IF('random picks'!$C93=3,'random picks'!$C$78,IF('random picks'!$D93=3,'random picks'!$D$78,IF('random picks'!$E93=3,'random picks'!$E$78,IF('random picks'!$F93=3,'random picks'!$F$78,IF('random picks'!$G93=3,'random picks'!$G$78,IF('random picks'!$H93=3,'random picks'!$H$78,IF('random picks'!$I93=3,'random picks'!$I$78))))))))","v":"STUART D"},{"$f":"IF('random picks'!$B93=4,'random picks'!$B$78,IF('random picks'!$C93=4,'random picks'!$C$78,IF('random picks'!$D93=4,'random picks'!$D$78,IF('random picks'!$E93=4,'random picks'!$E$78,IF('random picks'!$F93=4,'random picks'!$F$78,IF('random picks'!$G93=4,'random picks'!$G$78,IF('random picks'!$H93=4,'random picks'!$H$78,IF('random picks'!$I93=4,'random picks'!$I$78))))))))","v":"BYRON"},{"$f":"IF('random picks'!$B93=5,'random picks'!$B$78,IF('random picks'!$C93=5,'random picks'!$C$78,IF('random picks'!$D93=5,'random picks'!$D$78,IF('random picks'!$E93=5,'random picks'!$E$78,IF('random picks'!$F93=5,'random picks'!$F$78,IF('random picks'!$G93=5,'random picks'!$G$78,IF('random picks'!$H93=5,'random picks'!$H$78,IF('random picks'!$I93=5,'random picks'!$I$78))))))))","v":"DEANO"},{"$f":"IF('random picks'!$B93=6,'random picks'!$B$78,IF('random picks'!$C93=6,'random picks'!$C$78,IF('random picks'!$D93=6,'random picks'!$D$78,IF('random picks'!$E93=6,'random picks'!$E$78,IF('random picks'!$F93=6,'random picks'!$F$78,IF('random picks'!$G93=6,'random picks'!$G$78,IF('random picks'!$H93=6,'random picks'!$H$78,IF('random picks'!$I93=6,'random picks'!$I$78))))))))","v":"STEVER"},{"$f":"IF('random picks'!$B93=7,'random picks'!$B$78,IF('random picks'!$C93=7,'random picks'!$C$78,IF('random picks'!$D93=7,'random picks'!$D$78,IF('random picks'!$E93=7,'random picks'!$E$78,IF('random picks'!$F93=7,'random picks'!$F$78,IF('random picks'!$G93=7,'random picks'!$G$78,IF('random picks'!$H93=7,'random picks'!$H$78,IF('random picks'!$I93=7,'random picks'!$I$78))))))))","v":"TEZ"},{"$f":"IF('random picks'!$B93=8,'random picks'!$B$78,IF('random picks'!$C93=8,'random picks'!$C$78,IF('random picks'!$D93=8,'random picks'!$D$78,IF('random picks'!$E93=8,'random picks'!$E$78,IF('random picks'!$F93=8,'random picks'!$F$78,IF('random picks'!$G93=8,'random picks'!$G$78,IF('random picks'!$H93=8,'random picks'!$H$78,IF('random picks'!$I93=8,'random picks'!$I$78))))))))","v":false}]
["R5",{"$f":"IF('random picks'!$B94=1,'random picks'!$B$78,IF('random picks'!$C94=1,'random picks'!$C$78,IF('random picks'!$D94=1,'random picks'!$D$78,IF('random picks'!$E94=1,'random picks'!$E$78,IF('random picks'!$F94=1,'random picks'!$F$78,IF('random picks'!$G94=1,'random picks'!$G$78,IF('random picks'!$H94=1,'random picks'!$H$78,IF('random picks'!$I94=1,'random picks'!$I$78))))))))","v":"TEZ"},{"$f":"IF('random picks'!$B94=2,'random picks'!$B$78,IF('random picks'!$C94=2,'random picks'!$C$78,IF('random picks'!$D94=2,'random picks'!$D$78,IF('random picks'!$E94=2,'random picks'!$E$78,IF('random picks'!$F94=2,'random picks'!$F$78,IF('random picks'!$G94=2,'random picks'!$G$78,IF('random picks'!$H94=2,'random picks'!$H$78,IF('random picks'!$I94=2,'random picks'!$I$78))))))))","v":"BYRON"},{"$f":"IF('random picks'!$B94=3,'random picks'!$B$78,IF('random picks'!$C94=3,'random picks'!$C$78,IF('random picks'!$D94=3,'random picks'!$D$78,IF('random picks'!$E94=3,'random picks'!$E$78,IF('random picks'!$F94=3,'random picks'!$F$78,IF('random picks'!$G94=3,'random picks'!$G$78,IF('random picks'!$H94=3,'random picks'!$H$78,IF('random picks'!$I94=3,'random picks'!$I$78))))))))","v":"CRAIG T"},{"$f":"IF('random picks'!$B94=4,'random picks'!$B$78,IF('random picks'!$C94=4,'random picks'!$C$78,IF('random picks'!$D94=4,'random picks'!$D$78,IF('random picks'!$E94=4,'random picks'!$E$78,IF('random picks'!$F94=4,'random picks'!$F$78,IF('random picks'!$G94=4,'random picks'!$G$78,IF('random picks'!$H94=4,'random picks'!$H$78,IF('random picks'!$I94=4,'random picks'!$I$78))))))))","v":"JOHN C"},{"$f":"IF('random picks'!$B94=5,'random picks'!$B$78,IF('random picks'!$C94=5,'random picks'!$C$78,IF('random picks'!$D94=5,'random picks'!$D$78,IF('random picks'!$E94=5,'random picks'!$E$78,IF('random picks'!$F94=5,'random picks'!$F$78,IF('random picks'!$G94=5,'random picks'!$G$78,IF('random picks'!$H94=5,'random picks'!$H$78,IF('random picks'!$I94=5,'random picks'!$I$78))))))))","v":"DEANO"},{"$f":"IF('random picks'!$B94=6,'random picks'!$B$78,IF('random picks'!$C94=6,'random picks'!$C$78,IF('random picks'!$D94=6,'random picks'!$D$78,IF('random picks'!$E94=6,'random picks'!$E$78,IF('random picks'!$F94=6,'random picks'!$F$78,IF('random picks'!$G94=6,'random picks'!$G$78,IF('random picks'!$H94=6,'random picks'!$H$78,IF('random picks'!$I94=6,'random picks'!$I$78))))))))","v":"STUART D"},{"$f":"IF('random picks'!$B94=7,'random picks'!$B$78,IF('random picks'!$C94=7,'random picks'!$C$78,IF('random picks'!$D94=7,'random picks'!$D$78,IF('random picks'!$E94=7,'random picks'!$E$78,IF('random picks'!$F94=7,'random picks'!$F$78,IF('random picks'!$G94=7,'random picks'!$G$78,IF('random picks'!$H94=7,'random picks'!$H$78,IF('random picks'!$I94=7,'random picks'!$I$78))))))))","v":"STEVER"},{"$f":"IF('random picks'!$B94=8,'random picks'!$B$78,IF('random picks'!$C94=8,'random picks'!$C$78,IF('random picks'!$D94=8,'random picks'!$D$78,IF('random picks'!$E94=8,'random picks'!$E$78,IF('random picks'!$F94=8,'random picks'!$F$78,IF('random picks'!$G94=8,'random picks'!$G$78,IF('random picks'!$H94=8,'random picks'!$H$78,IF('random picks'!$I94=8,'random picks'!$I$78))))))))","v":false}]